Reaction Details
TargetAmyloid-beta precursor protein
LigandBDBM195595
Substrate/Competitorn/a
Meas. Tech.In Vitro Competitive Radioligand Binding Assay
Kd 927±0.0 nM
Citation Zipfel, GHan, BMach, RChu, W Phenoxazine derivatives and methods of use thereof US Patent US9216974 Publication Date 12/22/2015
 
Amyloid-beta precursor protein
Name:Amyloid-beta precursor protein
Type:Single-pass type I membrane protein
Mol. Mass.:86890.41
Organism:Homo sapiens (Human)
Description:P05067
Residue:770
BDBM195595
NameBDBM195595
Synonyms:US9216974, WC-5-9
TypeSmall organic molecule
Emp. Form.C14H10BrNO3
Mol. Mass.320.138
SMILESBrCCOc1ccc2nc3ccc(=O)cc3oc2c1