Reaction Details
TargetAmyloid-beta precursor protein
LigandBDBM21360
Substrate/Competitorn/a
Meas. Tech.In Vitro Competitive Radioligand Binding Assay
Ki 262±0.0 nM
Citation Zipfel, GHan, BMach, RChu, W Phenoxazine derivatives and methods of use thereof US Patent US9216974 Publication Date 12/22/2015
 
Amyloid-beta precursor protein
Name:Amyloid-beta precursor protein
Type:Single-pass type I membrane protein
Mol. Mass.:86890.41
Organism:Homo sapiens (Human)
Description:P05067
Residue:770
BDBM21360
NameBDBM21360
Synonyms:7-ethoxy-3H-phenoxazin-3-one Ethoxyresorufin | US9216974, Ethoxy-resorufin
TypeSmall organic molecule
Emp. Form.C14H11NO3
Mol. Mass.241.242
SMILESCCOc1ccc2nc3ccc(=O)cc3oc2c1