Reaction Details
TargetIsocitrate dehydrogenase [NADP] cytoplasmic [R132G]
LigandBDBM195601
Substrate/Competitorn/a
Meas. Tech.RapidFire-MS/MS and NADPH Assays
Temperature298.15±n/a K
IC50 2.9±0.0 nM
Commentsextracted
Citation Okoye-Okafor, UCBartholdy, BCartier, JGao, ENPietrak, BRendina, ARRominger, CQuinn, CSmallwood, AWiggall, KJReif, AJSchmidt, SJQi, HZhao, HJoberty, GFaelth-Savitski, MBantscheff, MDrewes, GDuraiswami, CBrady, PGroy, ANarayanagari, SRAntony-Debre, IMitchell, KWang, HRKao, YRChristopeit, MCarvajal, LBarreyro, LPaietta, EMakishima, HWill, BConcha, NAdams, NDSchwartz, BMcCabe, MTMaciejewski, JVerma, ASteidl, U New IDH1 mutant inhibitors for treatment of acute myeloid leukemia Nat Chem Biol11:878-86 (2015) 
 
Isocitrate dehydrogenase [NADP] cytoplasmic [R132G]
Name:Isocitrate dehydrogenase [NADP] cytoplasmic [R132G]
Type:Protein
Mol. Mass.:46561.14
Organism:Homo sapiens (Human)
Description:R132G mutant
Residue:414
BDBM195601
NameBDBM195601
Synonyms:GSK321 US11376246, Cpd ID GSK321 | US11576906, Compound GSK321
TypeSmall organic molecule
Emp. Form.C28H28FN5O3
Mol. Mass.501.552
SMILESC[C@H](O)c1cccc(NC(=O)c2nn(Cc3ccc(F)cc3)c3[C@H](C)CN(Cc23)C(=O)c2ccc[nH]2)c1