Reaction Details
TargetIsocitrate dehydrogenase [NADP], mitochondrial [R140Q]
LigandBDBM195602
Substrate/Competitorn/a
Meas. Tech.RapidFire-MS/MS and NADPH Assays
Temperature298.15±n/a K
IC50>100000±0.0 nM
Commentsextracted
Citation Okoye-Okafor, UCBartholdy, BCartier, JGao, ENPietrak, BRendina, ARRominger, CQuinn, CSmallwood, AWiggall, KJReif, AJSchmidt, SJQi, HZhao, HJoberty, GFaelth-Savitski, MBantscheff, MDrewes, GDuraiswami, CBrady, PGroy, ANarayanagari, SRAntony-Debre, IMitchell, KWang, HRKao, YRChristopeit, MCarvajal, LBarreyro, LPaietta, EMakishima, HWill, BConcha, NAdams, NDSchwartz, BMcCabe, MTMaciejewski, JVerma, ASteidl, U New IDH1 mutant inhibitors for treatment of acute myeloid leukemia Nat Chem Biol11:878-86 (2015) 
 
Isocitrate dehydrogenase [NADP], mitochondrial [R140Q]
Name:Isocitrate dehydrogenase [NADP], mitochondrial [R140Q]
Type:Protein
Mol. Mass.:50894.25
Organism:Homo sapiens (Human)
Description:R140Q mutant
Residue:452
BDBM195602
NameBDBM195602
Synonyms:GSK990
TypeSmall organic molecule
Emp. Form.C23H23N7O2
Mol. Mass.429.4744
SMILESCc1cccc(NC(=O)c2nn(Cc3c[nH]cn3)c3CCN(Cc23)C(=O)c2ccc[nH]2)c1