Reaction Details
TargetLysine-specific demethylase 5A
LigandBDBM195608
Substrate/Competitorn/a
Meas. Tech.KDM5 TR-FRET Assay
pH7±n/a
IC50 10± 1 nM
Commentsextracted
Citation Vinogradova, MGehling, VSGustafson, AArora, STindell, CAWilson, CWilliamson, KEGuler, GDGangurde, PManieri, WBusby, JFlynn, EMLan, FKim, HJOdate, SCochran, AGLiu, YWongchenko, MYang, YCheung, TKMaile, TMLau, TCosta, MHegde, GVJackson, EPitti, RArnott, DBailey, CBellon, SCummings, RTAlbrecht, BKHarmange, JCKiefer, JRTrojer, PClasson, M An inhibitor of KDM5 demethylases reduces survival of drug-tolerant cancer cells. Nat Chem Biol12:531-8 (2016) 
 
Lysine-specific demethylase 5A
Name:Lysine-specific demethylase 5A
Type:Protein
Mol. Mass.:192091.79
Organism:Homo sapiens (Human)
Description:P29375
Residue:1690
BDBM195608
NameBDBM195608
Synonyms:CPI-455
TypeSmall organic molecule
Emp. Form.C16H14N4O
Mol. Mass.278.3086
SMILESCC(C)c1c([nH]c2c(cnn2c1=O)C#N)-c1ccccc1