Reaction Details
TargetLysine-specific demethylase 5B
LigandBDBM195608
Substrate/Competitorn/a
Meas. Tech.KDM5 TR-FRET Assay
pH7±n/a
IC50 3±n/a nM
Commentsextracted
Citation Vinogradova, MGehling, VSGustafson, AArora, STindell, CAWilson, CWilliamson, KEGuler, GDGangurde, PManieri, WBusby, JFlynn, EMLan, FKim, HJOdate, SCochran, AGLiu, YWongchenko, MYang, YCheung, TKMaile, TMLau, TCosta, MHegde, GVJackson, EPitti, RArnott, DBailey, CBellon, SCummings, RTAlbrecht, BKHarmange, JCKiefer, JRTrojer, PClasson, M An inhibitor of KDM5 demethylases reduces survival of drug-tolerant cancer cells. Nat Chem Biol12:531-8 (2016) 
 
Lysine-specific demethylase 5B
Name:Lysine-specific demethylase 5B
Type:Protein
Mol. Mass.:175659.67
Organism:Homo sapiens (Human)
Description:Q9UGL1
Residue:1544
BDBM195608
NameBDBM195608
Synonyms:CPI-455
TypeSmall organic molecule
Emp. Form.C16H14N4O
Mol. Mass.278.3086
SMILESCC(C)c1c([nH]c2c(cnn2c1=O)C#N)-c1ccccc1