Reaction Details
TargetLysine-specific demethylase 5D [1-775]
LigandBDBM26113
Substrate/Competitorn/a
Meas. Tech.Demethylase AlphaScreen Assay
pH7.5±n/a
IC50 2.5e+3±n/a nM
Commentsextracted
Citation Johansson, CVelupillai, STumber, ASzykowska, AHookway, ESNowak, RPStrain-Damerell, CGileadi, CPhilpott, MBurgess-Brown, NWu, NKopec, JNuzzi, ASteuber, HEgner, UBadock, VMunro, SLaThangue, NBWestaway, SBrown, JAthanasou, NPrinjha, RBrennan, PEOppermann, U Structural analysis of human KDM5B guides histone demethylase inhibitor development. Nat Chem Biol12:539-45 (2016) 
 
Lysine-specific demethylase 5D [1-775]
Name:Lysine-specific demethylase 5D [1-775]
Type:Protein
Mol. Mass.:89076.46
Organism:Homo sapiens (Human)
Description:Human KDM5D (1-775 aa)
Residue:775
BDBM26113
NameBDBM26113
Synonyms:2,4 PDCA pyridine carboxylate, 6a | pyridine-2,4-dicarboxylic acid
TypeSmall organic molecule
Emp. Form.C7H5NO4
Mol. Mass.167.1189
SMILESOC(=O)c1ccnc(c1)C(O)=O