Reaction Details
TargetLysine-specific demethylase 5C [1-765]
LigandBDBM195612
Substrate/Competitorn/a
Meas. Tech.Demethylase AlphaScreen Assay
pH7.5±n/a
IC50 65±n/a nM
Commentsextracted
Citation Johansson, CVelupillai, STumber, ASzykowska, AHookway, ESNowak, RPStrain-Damerell, CGileadi, CPhilpott, MBurgess-Brown, NWu, NKopec, JNuzzi, ASteuber, HEgner, UBadock, VMunro, SLaThangue, NBWestaway, SBrown, JAthanasou, NPrinjha, RBrennan, PEOppermann, U Structural analysis of human KDM5B guides histone demethylase inhibitor development. Nat Chem Biol12:539-45 (2016) 
 
Lysine-specific demethylase 5C [1-765]
Name:Lysine-specific demethylase 5C [1-765]
Type:Protein
Mol. Mass.:88156.60
Organism:Homo sapiens (Human)
Description:Human KDM5C (1-765 aa)
Residue:765
BDBM195612
NameBDBM195612
Synonyms:GSK467
TypeSmall organic molecule
Emp. Form.C17H13N5O2
Mol. Mass.319.3174
SMILESO=c1[nH]c(Oc2cnn(Cc3ccccc3)c2)nc2cnccc12