Reaction Details
TargetProlactin-releasing peptide receptor
LigandBDBM195640
Substrate/Competitorn/a
Meas. Tech.Inhibition Assay
pH7.4±n/a
Temperature298.15±n/a K
Ki 6±n/a nM
Commentsextracted
Citation Takahashi, ASuzuki, MNakamura, YSakurai, Y Heterocyclic compounds for the treatment of stress-related conditions US Patent US9206173 Publication Date 12/8/2015
 
Prolactin-releasing peptide receptor
Name:Prolactin-releasing peptide receptor
Type:Protein
Mol. Mass.:41138.32
Organism:Homo sapiens (Human)
Description:P49683
Residue:370
BDBM195640
NameBDBM195640
Synonyms:US9206173, 2402
TypeSmall organic molecule
Emp. Form.C30H27F3N6O2
Mol. Mass.560.5696
SMILESCC#CCn1c(N[C@@H](C)c2ccc(cc2)C(F)(F)F)nc2CCN(Cc2c1=O)C(=O)c1ccc(cc1)-n1ccnc1