Reaction Details
TargetProlactin-releasing peptide receptor
LigandBDBM195671
Substrate/Competitorn/a
Meas. Tech.Inhibition Assay
pH7.4±n/a
Temperature298.15±n/a K
Ki 5±n/a nM
Commentsextracted
Citation Takahashi, ASuzuki, MNakamura, YSakurai, Y Heterocyclic compounds for the treatment of stress-related conditions US Patent US9206173 Publication Date 12/8/2015
 
Prolactin-releasing peptide receptor
Name:Prolactin-releasing peptide receptor
Type:Protein
Mol. Mass.:41138.32
Organism:Homo sapiens (Human)
Description:P49683
Residue:370
BDBM195671
NameBDBM195671
Synonyms:US9206173, 2433
TypeSmall organic molecule
Emp. Form.C27H23F3N6O2
Mol. Mass.520.5057
SMILESCN(Nc1nc2CCN(Cc2c(=O)n1CCC#C)C(=O)c1ccc(cc1)C#N)c1ccc(cc1)C(F)(F)F