Reaction Details
TargetProlactin-releasing peptide receptor
LigandBDBM195722
Substrate/Competitorn/a
Meas. Tech.Inhibition Assay
pH7.4±n/a
Temperature298.15±n/a K
Ki 6±n/a nM
Commentsextracted
Citation Takahashi, ASuzuki, MNakamura, YSakurai, Y Heterocyclic compounds for the treatment of stress-related conditions US Patent US9206173 Publication Date 12/8/2015
 
Prolactin-releasing peptide receptor
Name:Prolactin-releasing peptide receptor
Type:Protein
Mol. Mass.:41138.32
Organism:Homo sapiens (Human)
Description:P49683
Residue:370
BDBM195722
NameBDBM195722
Synonyms:US9206173, 2484
TypeSmall organic molecule
Emp. Form.C24H22F6N6O2
Mol. Mass.540.4609
SMILESCN(C)n1c(NN(C)c2ccc(cc2)C(F)(F)F)nc2CCN(Cc2c1=O)C(=O)c1c(F)cc(F)cc1F