Reaction Details
TargetProlactin-releasing peptide receptor
LigandBDBM195733
Substrate/Competitorn/a
Meas. Tech.Inhibition Assay
pH7.4±n/a
Temperature298.15±n/a K
Ki 3±n/a nM
Commentsextracted
Citation Takahashi, ASuzuki, MNakamura, YSakurai, Y Heterocyclic compounds for the treatment of stress-related conditions US Patent US9206173 Publication Date 12/8/2015
 
Prolactin-releasing peptide receptor
Name:Prolactin-releasing peptide receptor
Type:Protein
Mol. Mass.:41138.32
Organism:Homo sapiens (Human)
Description:P49683
Residue:370
BDBM195733
NameBDBM195733
Synonyms:US9206173, 2495
TypeSmall organic molecule
Emp. Form.C24H22ClN5O3S
Mol. Mass.495.981
SMILESCOn1c(N[C@@H](C)c2ccc(Cl)cc2)nc2CCN(Cc2c1=O)C(=O)c1cc2cccnc2s1