Reaction Details
TargetTyrosine-protein kinase JAK3
LigandBDBM195780
Substrate/Competitorn/a
Meas. Tech.Biochemical Inhibition Assay
IC50<5±n/a nM
Citation Vankayalapati, HYerramreddy, VGangireddy, PAppalaneni, RP Substituted pyrrolo[2,3-b]pyridines as ITK and JAK inhibitors US Patent US9206188 Publication Date 12/8/2015
 
Tyrosine-protein kinase JAK3
Name:Tyrosine-protein kinase JAK3
Type:Protein
Mol. Mass.:125111.08
Organism:Homo sapiens (Human)
Description:P52333
Residue:1124
BDBM195780
NameBDBM195780
Synonyms:US9206188, 31 | US9834551, Example 31
TypeSmall organic molecule
Emp. Form.C19H16FN3O
Mol. Mass.321.3482
SMILESCCC#CC(=O)Nc1cc(ccc1F)-c1cnc2[nH]cc(C)c2c1