Reaction Details
TargetTyrosine-protein kinase JAK3
LigandBDBM195828
Substrate/Competitorn/a
Meas. Tech.Biochemical Inhibition Assay
IC50<5±n/a nM
Citation Vankayalapati, HYerramreddy, VGangireddy, PAppalaneni, RP Substituted pyrrolo[2,3-b]pyridines as ITK and JAK inhibitors US Patent US9206188 Publication Date 12/8/2015
 
Tyrosine-protein kinase JAK3
Name:Tyrosine-protein kinase JAK3
Type:Protein
Mol. Mass.:125111.08
Organism:Homo sapiens (Human)
Description:P52333
Residue:1124
BDBM195828
NameBDBM195828
Synonyms:US9206188, 79 | US9834551, Example 79
TypeSmall organic molecule
Emp. Form.C15H9ClN4O
Mol. Mass.296.711
SMILESClc1c[nH]c2ncc(cc12)-c1cccc(NC(=O)C#C)n1