Reaction Details
TargetTyrosine-protein kinase JAK3
LigandBDBM195836
Substrate/Competitorn/a
Meas. Tech.Biochemical Inhibition Assay
IC50<5±n/a nM
Citation Vankayalapati, HYerramreddy, VGangireddy, PAppalaneni, RP Substituted pyrrolo[2,3-b]pyridines as ITK and JAK inhibitors US Patent US9206188 Publication Date 12/8/2015
 
Tyrosine-protein kinase JAK3
Name:Tyrosine-protein kinase JAK3
Type:Protein
Mol. Mass.:125111.08
Organism:Homo sapiens (Human)
Description:P52333
Residue:1124
BDBM195836
NameBDBM195836
Synonyms:US9206188, 87 | US9834551, Example 87
TypeSmall organic molecule
Emp. Form.C17H12FN3O
Mol. Mass.293.2951
SMILESCC#CC(=O)Nc1cc(ccc1F)-c1cnc2[nH]ccc2c1