Reaction Details
TargetTyrosine-protein kinase JAK3
LigandBDBM195904
Substrate/Competitorn/a
Meas. Tech.Biochemical Inhibition Assay
IC50<5.00±n/a nM
Citation Vankayalapati, HYerramreddy, VGangireddy, PAppalaneni, RP Substituted pyrrolo[2,3-b]pyridines as ITK and JAK inhibitors US Patent US9206188 Publication Date 12/8/2015
 
Tyrosine-protein kinase JAK3
Name:Tyrosine-protein kinase JAK3
Type:Protein
Mol. Mass.:125111.08
Organism:Homo sapiens (Human)
Description:P52333
Residue:1124
BDBM195904
NameBDBM195904
Synonyms:US9206188, 145 | US9834551, Example 145
TypeSmall organic molecule
Emp. Form.C26H25FN4O
Mol. Mass.428.5013
SMILESCN(C)C\C=C\C(=O)Nc1cccc(c1)-c1cnc2[nH]cc(-c3cccc(C)c3F)c2c1