Reaction Details
TargetGenome polyprotein
LigandBDBM110382
Substrate/Competitorn/a
Meas. Tech.Protease Assay
IC50 1.3±n/a nM
Citation Brandl, TRaman, PRigollier, PSeepersaud, MSimic, O Organic compounds and their uses US Patent US9206232 Publication Date 12/8/2015
 
Genome polyprotein
Name:Genome polyprotein
Type:Protease Domain
Mol. Mass.:327221.49
Organism:Hepatitis C virus (HCV genotype 1a, isolate H)
Description:P27958
Residue:3011
BDBM110382
NameBDBM110382
Synonyms:US8613914, 156 | US9206232, 156
TypeSmall organic molecule
Emp. Form.C45H74FN7O7S
Mol. Mass.876.175
SMILESCCN(CCF)S(=O)(=O)NC(=O)[C@]1(C[C@H]1C=C)NC(=O)[C@@H]1C[C@@]2(CN1C(=O)[C@@H](NC(=O)[C@@H](NC(=O)[C@@H]1CCCCN1C(C)C)C1CCCCC1)C(C)(C)C)C(C)(C)[C@]21CCC1