Reaction Details
TargetGenome polyprotein
LigandBDBM110397
Substrate/Competitorn/a
Meas. Tech.Protease Assay
IC50 1±n/a nM
Citation Brandl, TRaman, PRigollier, PSeepersaud, MSimic, O Organic compounds and their uses US Patent US9206232 Publication Date 12/8/2015
 
Genome polyprotein
Name:Genome polyprotein
Type:Protease Domain
Mol. Mass.:327221.49
Organism:Hepatitis C virus (HCV genotype 1a, isolate H)
Description:P27958
Residue:3011
BDBM110397
NameBDBM110397
Synonyms:US8613914, 171 | US9206232, 171
TypeSmall organic molecule
Emp. Form.C44H72ClN7O7S
Mol. Mass.878.603
SMILESCC(C)N1CCCC[C@H]1C(=O)NC(C1CCCCC1)C(=O)N[C@H](C(=O)N1C[C@]2(C[C@H]1C(=O)N[C@@]1(C[C@H]1C=C)C(=O)NS(=O)(=O)N(C)CCCl)C(C)(C)C21CCC1)C(C)(C)C