Reaction Details
TargetGenome polyprotein
LigandBDBM110400
Substrate/Competitorn/a
Meas. Tech.Protease Assay
IC50 0.6±n/a nM
Citation Brandl, TRaman, PRigollier, PSeepersaud, MSimic, O Organic compounds and their uses US Patent US9206232 Publication Date 12/8/2015
 
Genome polyprotein
Name:Genome polyprotein
Type:Protease Domain
Mol. Mass.:327221.49
Organism:Hepatitis C virus (HCV genotype 1a, isolate H)
Description:P27958
Residue:3011
BDBM110400
NameBDBM110400
Synonyms:US8613914, 174 | US9206232, 174
TypeSmall organic molecule
Emp. Form.C45H75N7O7S
Mol. Mass.858.185
SMILESCCN(CC)S(=O)(=O)NC(=O)[C@]1(C[C@H]1C=C)NC(=O)[C@@H]1C[C@@]2(CN1C(=O)[C@@H](NC(=O)C(NC(=O)[C@@H]1CCCCN1C(C)C)C1CCCCC1)C(C)(C)C)C(C)(C)C21CCC1