Reaction Details
TargetDNA polymerase
LigandBDBM196132
Substrate/Competitorn/a
Meas. Tech.Inhibition Assay
pH7.4±n/a
Temperature310.15±n/a K
IC50 1300±n/a nM
Commentsextracted
Citation Ricciardi, RP Therapeutic compounds for blocking DNA synthesis of POX viruses US Patent US9211296 Publication Date 12/15/2015
 
DNA polymerase
Name:DNA polymerase
Type:Enzyme
Mol. Mass.:116939.47
Organism:Vaccinia virus (strain WR)
Description:P06856
Residue:1006
BDBM196132
NameBDBM196132
Synonyms:US9211296, Table 7, Compd: 2
TypeSmall organic molecule
Emp. Form.C14H10BrN3O
Mol. Mass.316.153
SMILESBrCc1ccc(cc1)-c1noc(n1)-c1ccncc1