Reaction Details
TargetDNA polymerase
LigandBDBM196145
Substrate/Competitorn/a
Meas. Tech.Inhibition Assay
pH7.4±n/a
Temperature310.15±n/a K
IC50 10000±n/a nM
Commentsextracted
Citation Ricciardi, RP Therapeutic compounds for blocking DNA synthesis of POX viruses US Patent US9211296 Publication Date 12/15/2015
 
DNA polymerase
Name:DNA polymerase
Type:Enzyme
Mol. Mass.:116939.47
Organism:Vaccinia virus (strain WR)
Description:P06856
Residue:1006
BDBM196145
NameBDBM196145
Synonyms:US9211296, Table 7, Compd: 18
TypeSmall organic molecule
Emp. Form.C19H20ClN3OS
Mol. Mass.373.9
SMILESClc1nc2ccccc2c2sc(cc12)C(=O)NCCCN1CCCC1