Reaction Details
TargetHistone deacetylase 6 [440-798,S531A]
LigandBDBM198125
Substrate/Competitorn/a
Meas. Tech.HDAC6 fluorescence anisotropy assay
Temperature298.15±n/a K
Kd 170±40 nM
Commentsextracted
Citation Hai, YUniversity of Pennsylvania,, DW Histone deacetylase 6 structure and molecular basis of catalysis and inhibition Nat Chem Biol12:741-747 (2016) 
 
Histone deacetylase 6 [440-798,S531A]
Name:Histone deacetylase 6 [440-798,S531A]
Type:n/a
Mol. Mass.:39834.25
Organism:Danio rerio
Description:F8W4B7[440-798,S531A]
Residue:359
BDBM198125
NameBDBM198125
Synonyms:fl-SAHA
TypeSmall organic molecule
Emp. Form.C28H26N2O8
Mol. Mass.518.5146
SMILESONC(=O)CCCCCCC(=O)Nc1ccc(c(c1)C(O)=O)-c1c2ccc(O)cc2oc2cc(=O)ccc12