Reaction Details
TargetProstaglandin D2 receptor 2
LigandBDBM196953
Substrate/Competitorn/a
Meas. Tech.Radioligand Binding Assay
pH7.4±n/a
Ki 1.2±n/a nM
Commentsextracted
Citation Martyres, DAnderskewitz, RHoenke, CKriegl, JOost, TRist, WSeither, P Pyrazole compounds as CRTH2 antagonists US Patent US9206164 Publication Date 12/8/2015
 
Prostaglandin D2 receptor 2
Name:Prostaglandin D2 receptor 2
Type:Enzyme
Mol. Mass.:43295.45
Organism:Homo sapiens (Human)
Description:Q9Y5Y4
Residue:395
BDBM196953
NameBDBM196953
Synonyms:US9206164, 17 | US9206164, 49
TypeSmall organic molecule
Emp. Form.C21H18Cl2N4O2
Mol. Mass.429.299
SMILESCc1nn(Cc2ccc(cc2)-c2nc3cc(Cl)c(Cl)cc3[nH]2)c(C)c1CC(O)=O