Reaction Details
TargetProstaglandin D2 receptor 2
LigandBDBM197012
Substrate/Competitorn/a
Meas. Tech.Radioligand Binding Assay
pH7.4±n/a
Ki 0.6±n/a nM
Commentsextracted
Citation Martyres, DAnderskewitz, RHoenke, CKriegl, JOost, TRist, WSeither, P Pyrazole compounds as CRTH2 antagonists US Patent US9206164 Publication Date 12/8/2015
 
Prostaglandin D2 receptor 2
Name:Prostaglandin D2 receptor 2
Type:Enzyme
Mol. Mass.:43295.45
Organism:Homo sapiens (Human)
Description:Q9Y5Y4
Residue:395
BDBM197012
NameBDBM197012
Synonyms:US9206164, 76
TypeSmall organic molecule
Emp. Form.C23H21ClF2N4O2
Mol. Mass.458.888
SMILESCCc1nn(Cc2ccc(cc2F)-c2nc3cc(F)c(Cl)cc3[nH]2)c(CC)c1CC(O)=O