Reaction Details
TargetProstaglandin D2 receptor 2
LigandBDBM197015
Substrate/Competitorn/a
Meas. Tech.Radioligand Binding Assay
pH7.4±n/a
Ki 1.3±n/a nM
Commentsextracted
Citation Martyres, DAnderskewitz, RHoenke, CKriegl, JOost, TRist, WSeither, P Pyrazole compounds as CRTH2 antagonists US Patent US9206164 Publication Date 12/8/2015
 
Prostaglandin D2 receptor 2
Name:Prostaglandin D2 receptor 2
Type:Enzyme
Mol. Mass.:43295.45
Organism:Homo sapiens (Human)
Description:Q9Y5Y4
Residue:395
BDBM197015
NameBDBM197015
Synonyms:US9206164, 79
TypeSmall organic molecule
Emp. Form.C23H24FN5O3
Mol. Mass.437.4668
SMILESCCc1nn(Cc2ccc(cc2F)-c2nc3nc(OC)ccc3[nH]2)c(CC)c1CC(O)=O