Reaction Details
TargetProstaglandin D2 receptor 2
LigandBDBM197033
Substrate/Competitorn/a
Meas. Tech.Radioligand Binding Assay
pH7.4±n/a
Ki 0.9±n/a nM
Commentsextracted
Citation Martyres, DAnderskewitz, RHoenke, CKriegl, JOost, TRist, WSeither, P Pyrazole compounds as CRTH2 antagonists US Patent US9206164 Publication Date 12/8/2015
 
Prostaglandin D2 receptor 2
Name:Prostaglandin D2 receptor 2
Type:Enzyme
Mol. Mass.:43295.45
Organism:Homo sapiens (Human)
Description:Q9Y5Y4
Residue:395
BDBM197033
NameBDBM197033
Synonyms:US9206164, 97
TypeSmall organic molecule
Emp. Form.C25H27FN4O2
Mol. Mass.434.5059
SMILESCc1nn(Cc2ccc(cc2F)-c2nc3cc(ccc3[nH]2)C(C)(C)C)c(C)c1CC(O)=O