Reaction Details
TargetIsoform 1 of Metabotropic glutamate receptor 5 (5a)
LigandBDBM196689
Substrate/Competitorn/a
Meas. Tech.Calcium Mobilization Assay
Temperature310.15±n/a K
EC50 212±n/a nM
Commentsextracted
Citation Jaeschke, GJolidon, SLindemann, LStadler, HVieira, E Ethynyl compounds US Patent US9212171 Publication Date 12/15/2015
 
Isoform 1 of Metabotropic glutamate receptor 5 (5a)
Name:Isoform 1 of Metabotropic glutamate receptor 5 (5a)
Type:Enzyme
Mol. Mass.:128885.13
Organism:Homo sapiens (Human)
Description:P41594-2
Residue:1180
BDBM196689
NameBDBM196689
Synonyms:US9212171, 14
TypeSmall organic molecule
Emp. Form.C21H21FN2O
Mol. Mass.336.4026
SMILESCN1C(=O)C(CCC1(C)C)c1ccc(cn1)C#Cc1ccc(F)cc1