Reaction Details
TargetLeucine-rich repeat serine/threonine-protein kinase 2
LigandBDBM196736
Substrate/Competitorn/a
Meas. Tech.Lanthascreen Binding Assay
Ki 1.1±n/a nM
Citation Baker-Glenn, CBurdick, DJChan, BKChambers, MChen, HEstrada, ASweeney, ZK Pyrazole aminopyrimidine derivatives as LRRK2 modulators US Patent US9212173 Publication Date 12/15/2015
 
Leucine-rich repeat serine/threonine-protein kinase 2
Name:Leucine-rich repeat serine/threonine-protein kinase 2
Type:Protein
Mol. Mass.:286113.20
Organism:Homo sapiens (Human)
Description:Q5S007
Residue:2527
BDBM196736
NameBDBM196736
Synonyms:US9212173, 14
TypeSmall organic molecule
Emp. Form.C17H21ClF3N9
Mol. Mass.443.857
SMILESCCNc1nc(Nc2cn(nc2Cl)C(C)(C)c2ncn(CC)n2)ncc1C(F)(F)F