Reaction Details
TargetLeucine-rich repeat serine/threonine-protein kinase 2
LigandBDBM196738
Substrate/Competitorn/a
Meas. Tech.Lanthascreen Binding Assay
Ki 140±n/a nM
Citation Baker-Glenn, CBurdick, DJChan, BKChambers, MChen, HEstrada, ASweeney, ZK Pyrazole aminopyrimidine derivatives as LRRK2 modulators US Patent US9212173 Publication Date 12/15/2015
 
Leucine-rich repeat serine/threonine-protein kinase 2
Name:Leucine-rich repeat serine/threonine-protein kinase 2
Type:Protein
Mol. Mass.:286113.20
Organism:Homo sapiens (Human)
Description:Q5S007
Residue:2527
BDBM196738
NameBDBM196738
Synonyms:US9212173, 16
TypeSmall organic molecule
Emp. Form.C18H23F3N8
Mol. Mass.408.424
SMILESCNc1nc(Nc2cn(nc2C)C(C)(C)c2nc(C)cn2C)ncc1C(F)(F)F