Reaction Details
TargetLeucine-rich repeat serine/threonine-protein kinase 2
LigandBDBM196744
Substrate/Competitorn/a
Meas. Tech.Lanthascreen Binding Assay
Ki 6.46±n/a nM
Citation Baker-Glenn, CBurdick, DJChan, BKChambers, MChen, HEstrada, ASweeney, ZK Pyrazole aminopyrimidine derivatives as LRRK2 modulators US Patent US9212173 Publication Date 12/15/2015
 
Leucine-rich repeat serine/threonine-protein kinase 2
Name:Leucine-rich repeat serine/threonine-protein kinase 2
Type:Protein
Mol. Mass.:286113.20
Organism:Homo sapiens (Human)
Description:Q5S007
Residue:2527
BDBM196744
NameBDBM196744
Synonyms:US9212173, 22
TypeSmall organic molecule
Emp. Form.C13H17F3N6O3S
Mol. Mass.394.373
SMILESCNc1nc(Nc2cnn(c2C)S(=O)(=O)CCOC)ncc1C(F)(F)F