Reaction Details
TargetLeucine-rich repeat serine/threonine-protein kinase 2
LigandBDBM196748
Substrate/Competitorn/a
Meas. Tech.Lanthascreen Binding Assay
Ki 4.3±n/a nM
Citation Baker-Glenn, CBurdick, DJChan, BKChambers, MChen, HEstrada, ASweeney, ZK Pyrazole aminopyrimidine derivatives as LRRK2 modulators US Patent US9212173 Publication Date 12/15/2015
 
Leucine-rich repeat serine/threonine-protein kinase 2
Name:Leucine-rich repeat serine/threonine-protein kinase 2
Type:Protein
Mol. Mass.:286113.20
Organism:Homo sapiens (Human)
Description:Q5S007
Residue:2527
BDBM196748
NameBDBM196748
Synonyms:US9212173, 26
TypeSmall organic molecule
Emp. Form.C17H19F3N8
Mol. Mass.392.3816
SMILESCNc1nc(Nc2cn(nc2C)C(C)(C)c2ncccn2)ncc1C(F)(F)F