Reaction Details
TargetLeucine-rich repeat serine/threonine-protein kinase 2
LigandBDBM196759
Substrate/Competitorn/a
Meas. Tech.Lanthascreen Binding Assay
Ki 0.6±n/a nM
Citation Baker-Glenn, CBurdick, DJChan, BKChambers, MChen, HEstrada, ASweeney, ZK Pyrazole aminopyrimidine derivatives as LRRK2 modulators US Patent US9212173 Publication Date 12/15/2015
 
Leucine-rich repeat serine/threonine-protein kinase 2
Name:Leucine-rich repeat serine/threonine-protein kinase 2
Type:Protein
Mol. Mass.:286113.20
Organism:Homo sapiens (Human)
Description:Q5S007
Residue:2527
BDBM196759
NameBDBM196759
Synonyms:US9212173, 37
TypeSmall organic molecule
Emp. Form.C15H18F4N6O
Mol. Mass.374.3366
SMILESCNc1nc(Nc2cn(nc2C)C2CCOC[C@H]2F)ncc1C(F)(F)F