Reaction Details
TargetTyrosine-protein kinase SYK
LigandBDBM60665
Substrate/Competitorn/a
Meas. Tech.Inhibition Assay
Temperature298.15±n/a K
IC50 23.62±n/a nM
Commentsextracted
Citation Lee, JChoi, JHwang, HSong, HKim, JKim, SKoh, JSLee, JLee, TChoi, YPark, SLee, IYSuh, BSalgaonkar, PDJung, D Substituted pyrimidine compounds and their use as SYK inhibitors US Patent US9212178 Publication Date 12/15/2015
 
Tyrosine-protein kinase SYK
Name:Tyrosine-protein kinase SYK
Type:Enzyme
Mol. Mass.:72079.99
Organism:Homo sapiens (Human)
Description:P43405
Residue:635
BDBM60665
NameBDBM60665
Synonyms:BDBM50249542 US9212178, R406
Typen/a
Emp. Form.C22H23FN6O5
Mol. Mass.470.4536
SMILESCOc1cc(Nc2ncc(F)c(Nc3ccc4OC(C)(C)C(=O)Nc4n3)n2)cc(OC)c1OC