Reaction Details
TargetLeucine-rich repeat serine/threonine-protein kinase 2
LigandBDBM196822
Substrate/Competitorn/a
Meas. Tech.Lanthascreen Binding Assay
Ki 1.8±n/a nM
Citation Baker-Glenn, CChan, BKDotson, JEstrada, AHeffron, TLyssikatos, JSweeney, Z Bicyclic pyrazole LRRK2 small molecule inhibitors US Patent US9212186 Publication Date 12/15/2015
 
Leucine-rich repeat serine/threonine-protein kinase 2
Name:Leucine-rich repeat serine/threonine-protein kinase 2
Type:Protein
Mol. Mass.:286113.20
Organism:Homo sapiens (Human)
Description:Q5S007
Residue:2527
BDBM196822
NameBDBM196822
Synonyms:US9212186, 18 US9212186, 20 | US9212186, 21
TypeSmall organic molecule
Emp. Form.C14H17F3N6O
Mol. Mass.342.3196
SMILESCNc1nc(Nc2cnn3CC(C)OC(C)c23)ncc1C(F)(F)F