Reaction Details
TargetALK tyrosine kinase receptor
LigandBDBM196859
Substrate/Competitorn/a
Meas. Tech.Enzyme Inhibition Assay
pH7.4±n/a
Temperature298.15±n/a K
Ki 8±n/a nM
Commentsextracted
Citation Vasudevan, APenning, TDChen, HLiang, BWang, SWu, FShen, YLiu, CZou, ZPliushchev, M Bicyclic carboxamide inhibitors of kinases US Patent US9212192 Publication Date 12/15/2015
 
ALK tyrosine kinase receptor
Name:ALK tyrosine kinase receptor
Type:Protein
Mol. Mass.:176453.10
Organism:Homo sapiens (Human)
Description:Q9UM73
Residue:1620
BDBM196859
NameBDBM196859
Synonyms:US9212192, 22
TypeSmall organic molecule
Emp. Form.C25H22Cl2F3N7O
Mol. Mass.564.39
SMILESNC(=O)c1c(Nc2ccc(cc2C(F)(F)F)N2CCNCC2)nc(Cc2c(Cl)cccc2Cl)c2nc[nH]c12