Reaction Details
TargetALK tyrosine kinase receptor
LigandBDBM196863
Substrate/Competitorn/a
Meas. Tech.Enzyme Inhibition Assay
pH7.4±n/a
Temperature298.15±n/a K
Ki<1±n/a nM
Commentsextracted
Citation Vasudevan, APenning, TDChen, HLiang, BWang, SWu, FShen, YLiu, CZou, ZPliushchev, M Bicyclic carboxamide inhibitors of kinases US Patent US9212192 Publication Date 12/15/2015
 
ALK tyrosine kinase receptor
Name:ALK tyrosine kinase receptor
Type:Protein
Mol. Mass.:176453.10
Organism:Homo sapiens (Human)
Description:Q9UM73
Residue:1620
BDBM196863
NameBDBM196863
Synonyms:US9212192, 26
TypeSmall organic molecule
Emp. Form.C25H25Cl2N7O
Mol. Mass.510.418
SMILESCc1cc(ccc1Nc1nc(Cc2c(Cl)cccc2Cl)c2nc[nH]c2c1C(N)=O)N1CCNCC1