Reaction Details
TargetMetabotropic glutamate receptor 4
LigandBDBM196913
Substrate/Competitorn/a
Meas. Tech.Pharmacological Assay
EC50 380±90 nM
Citation Acher, FPin, JGoudet, CEschalier, ABusserolles, JRigault, DLemasson, ICesarini, SCommare, B Hypophosphorous acid derivatives having antihyperalgic activity and biological applications thereof US Patent US9212196 Publication Date 12/15/2015
 
Metabotropic glutamate receptor 4
Name:Metabotropic glutamate receptor 4
Type:Enzyme
Mol. Mass.:101849.79
Organism:Rattus norvegicus (Rat)
Description:P31423
Residue:912
BDBM196913
NameBDBM196913
Synonyms:US9212196, Derivative 9
TypeSmall organic molecule
Emp. Form.C13H16Cl2NO8P
Mol. Mass.416.148
SMILESN[C@H](CCP(O)(=O)C(O)c1cc(Cl)c(OCC(O)=O)c(Cl)c1)C(O)=O