Reaction Details
TargetMetabotropic glutamate receptor 4
LigandBDBM196917
Substrate/Competitorn/a
Meas. Tech.Pharmacological Assay
EC50 12200±100 nM
Citation Acher, FPin, JGoudet, CEschalier, ABusserolles, JRigault, DLemasson, ICesarini, SCommare, B Hypophosphorous acid derivatives having antihyperalgic activity and biological applications thereof US Patent US9212196 Publication Date 12/15/2015
 
Metabotropic glutamate receptor 4
Name:Metabotropic glutamate receptor 4
Type:Enzyme
Mol. Mass.:101849.79
Organism:Rattus norvegicus (Rat)
Description:P31423
Residue:912
BDBM196917
NameBDBM196917
Synonyms:US9212196, Derivative 13
TypeSmall organic molecule
Emp. Form.C13H20NO7P
Mol. Mass.333.2742
SMILESN[C@H](CCP(O)(=O)C(O)c1ccc(OCCO)cc1)C(O)=O