Reaction Details
TargetMetabotropic glutamate receptor 4
LigandBDBM196922
Substrate/Competitorn/a
Meas. Tech.Pharmacological Assay
EC50 2500±1100 nM
Citation Acher, FPin, JGoudet, CEschalier, ABusserolles, JRigault, DLemasson, ICesarini, SCommare, B Hypophosphorous acid derivatives having antihyperalgic activity and biological applications thereof US Patent US9212196 Publication Date 12/15/2015
 
Metabotropic glutamate receptor 4
Name:Metabotropic glutamate receptor 4
Type:Enzyme
Mol. Mass.:101849.79
Organism:Rattus norvegicus (Rat)
Description:P31423
Residue:912
BDBM196922
NameBDBM196922
Synonyms:US9212196, Derivative 18
TypeSmall organic molecule
Emp. Form.C15H20NO11P
Mol. Mass.421.2932
SMILESN[C@H](CCP(O)(=O)C(O)c1ccc(OCC(O)=O)c(OCC(O)=O)c1)C(O)=O