Reaction Details
TargetMetabotropic glutamate receptor 4
LigandBDBM196923
Substrate/Competitorn/a
Meas. Tech.Pharmacological Assay
EC50 1670±330 nM
Citation Acher, FPin, JGoudet, CEschalier, ABusserolles, JRigault, DLemasson, ICesarini, SCommare, B Hypophosphorous acid derivatives having antihyperalgic activity and biological applications thereof US Patent US9212196 Publication Date 12/15/2015
 
Metabotropic glutamate receptor 4
Name:Metabotropic glutamate receptor 4
Type:Enzyme
Mol. Mass.:101849.79
Organism:Rattus norvegicus (Rat)
Description:P31423
Residue:912
BDBM196923
NameBDBM196923
Synonyms:US9212196, Derivative 19
TypeSmall organic molecule
Emp. Form.C15H22NO9P
Mol. Mass.391.3102
SMILESCCOc1cc(ccc1OCC(O)=O)C(O)P(O)(=O)CC[C@@H](N)C(O)=O