Reaction Details
TargetMetabotropic glutamate receptor 4
LigandBDBM196924
Substrate/Competitorn/a
Meas. Tech.Pharmacological Assay
EC50 60±20 nM
Citation Acher, FPin, JGoudet, CEschalier, ABusserolles, JRigault, DLemasson, ICesarini, SCommare, B Hypophosphorous acid derivatives having antihyperalgic activity and biological applications thereof US Patent US9212196 Publication Date 12/15/2015
 
Metabotropic glutamate receptor 4
Name:Metabotropic glutamate receptor 4
Type:Enzyme
Mol. Mass.:101849.79
Organism:Rattus norvegicus (Rat)
Description:P31423
Residue:912
BDBM196924
NameBDBM196924
Synonyms:US9212196, Derivative 20
TypeSmall organic molecule
Emp. Form.C14H17F3NO9P
Mol. Mass.431.2551
SMILESN[C@H](CCP(O)(=O)C(O)c1ccc(OCC(O)=O)c(OC(F)(F)F)c1)C(O)=O