Reaction Details
TargetMetabotropic glutamate receptor 4
LigandBDBM196927
Substrate/Competitorn/a
Meas. Tech.Pharmacological Assay
EC50 4000±600 nM
Citation Acher, FPin, JGoudet, CEschalier, ABusserolles, JRigault, DLemasson, ICesarini, SCommare, B Hypophosphorous acid derivatives having antihyperalgic activity and biological applications thereof US Patent US9212196 Publication Date 12/15/2015
 
Metabotropic glutamate receptor 4
Name:Metabotropic glutamate receptor 4
Type:Enzyme
Mol. Mass.:101849.79
Organism:Rattus norvegicus (Rat)
Description:P31423
Residue:912
BDBM196927
NameBDBM196927
Synonyms:US9212196, Derivative 23
TypeSmall organic molecule
Emp. Form.C14H18NO10P
Mol. Mass.391.2672
SMILESN[C@H](CCP(O)(=O)C(O)c1ccc(OCC(O)=O)c(c1)C(O)=O)C(O)=O