Reaction Details
TargetMetabotropic glutamate receptor 4
LigandBDBM196936
Substrate/Competitorn/a
Meas. Tech.Pharmacological Assay
EC50 1220±150 nM
Citation Acher, FPin, JGoudet, CEschalier, ABusserolles, JRigault, DLemasson, ICesarini, SCommare, B Hypophosphorous acid derivatives having antihyperalgic activity and biological applications thereof US Patent US9212196 Publication Date 12/15/2015
 
Metabotropic glutamate receptor 4
Name:Metabotropic glutamate receptor 4
Type:Enzyme
Mol. Mass.:101849.79
Organism:Rattus norvegicus (Rat)
Description:P31423
Residue:912
BDBM196936
NameBDBM196936
Synonyms:US9212196, Derivative 32
TypeSmall organic molecule
Emp. Form.C14H17F3NO8P
Mol. Mass.415.2557
SMILESN[C@H](CCP(O)(=O)Cc1ccc(OCC(O)=O)c(OC(F)(F)F)c1)C(O)=O