Reaction Details
TargetMetabotropic glutamate receptor 8
LigandBDBM82006
Substrate/Competitorn/a
Meas. Tech.Pharmacological Assay
EC50 290±70 nM
Citation Acher, FPin, JGoudet, CEschalier, ABusserolles, JRigault, DLemasson, ICesarini, SCommare, B Hypophosphorous acid derivatives having antihyperalgic activity and biological applications thereof US Patent US9212196 Publication Date 12/15/2015
 
Metabotropic glutamate receptor 8
Name:Metabotropic glutamate receptor 8
Type:Enzyme
Mol. Mass.:101886.18
Organism:Rattus norvegicus (Rat)
Description:P70579
Residue:908
BDBM82006
NameBDBM82006
Synonyms:D-AP4 US9212196, L-AP4
TypeSmall organic molecule
Emp. Form.C4H10NO5P
Mol. Mass.183.0997
SMILESN[C@H](CCP(O)(O)=O)C(O)=O