Reaction Details
TargetMetabotropic glutamate receptor 8
LigandBDBM196907
Substrate/Competitorn/a
Meas. Tech.Pharmacological Assay
EC50 18400±2400 nM
Citation Acher, FPin, JGoudet, CEschalier, ABusserolles, JRigault, DLemasson, ICesarini, SCommare, B Hypophosphorous acid derivatives having antihyperalgic activity and biological applications thereof US Patent US9212196 Publication Date 12/15/2015
 
Metabotropic glutamate receptor 8
Name:Metabotropic glutamate receptor 8
Type:Enzyme
Mol. Mass.:101886.18
Organism:Rattus norvegicus (Rat)
Description:P70579
Residue:908
BDBM196907
NameBDBM196907
Synonyms:US9212196, Derivative 3
TypeSmall organic molecule
Emp. Form.C14H20NO9P
Mol. Mass.377.2837
SMILESCOc1cc(ccc1OCC(O)=O)C(O)P(O)(=O)CC[C@@H](N)C(O)=O