Reaction Details
TargetMetabotropic glutamate receptor 8
LigandBDBM196909
Substrate/Competitorn/a
Meas. Tech.Pharmacological Assay
EC50 3720±310 nM
Citation Acher, FPin, JGoudet, CEschalier, ABusserolles, JRigault, DLemasson, ICesarini, SCommare, B Hypophosphorous acid derivatives having antihyperalgic activity and biological applications thereof US Patent US9212196 Publication Date 12/15/2015
 
Metabotropic glutamate receptor 8
Name:Metabotropic glutamate receptor 8
Type:Enzyme
Mol. Mass.:101886.18
Organism:Rattus norvegicus (Rat)
Description:P70579
Residue:908
BDBM196909
NameBDBM196909
Synonyms:US9212196, Derivative 5
TypeSmall organic molecule
Emp. Form.C14H19N2O11P
Mol. Mass.422.2812
SMILESCOc1cc(cc(c1OCC(O)=O)[N+]([O-])=O)C(O)P(O)(=O)CC[C@@H](N)C(O)=O