Reaction Details
TargetMetabotropic glutamate receptor 8
LigandBDBM196934
Substrate/Competitorn/a
Meas. Tech.Pharmacological Assay
EC50>100000±n/a nM
Citation Acher, FPin, JGoudet, CEschalier, ABusserolles, JRigault, DLemasson, ICesarini, SCommare, B Hypophosphorous acid derivatives having antihyperalgic activity and biological applications thereof US Patent US9212196 Publication Date 12/15/2015
 
Metabotropic glutamate receptor 8
Name:Metabotropic glutamate receptor 8
Type:Enzyme
Mol. Mass.:101886.18
Organism:Rattus norvegicus (Rat)
Description:P70579
Residue:908
BDBM196934
NameBDBM196934
Synonyms:US9212196, Derivative 30
TypeSmall organic molecule
Emp. Form.C13H18NO7P
Mol. Mass.331.2583
SMILESN[C@H](CCP(O)(=O)Cc1ccc(OCC(O)=O)cc1)C(O)=O