Reaction Details
TargetMetabotropic glutamate receptor 6
LigandBDBM196909
Substrate/Competitorn/a
Meas. Tech.Pharmacological Assay
EC50 5950±790 nM
Citation Acher, FPin, JGoudet, CEschalier, ABusserolles, JRigault, DLemasson, ICesarini, SCommare, B Hypophosphorous acid derivatives having antihyperalgic activity and biological applications thereof US Patent US9212196 Publication Date 12/15/2015
 
Metabotropic glutamate receptor 6
Name:Metabotropic glutamate receptor 6
Type:Enzyme
Mol. Mass.:95095.82
Organism:Rattus norvegicus (Rat)
Description:P35349
Residue:871
BDBM196909
NameBDBM196909
Synonyms:US9212196, Derivative 5
TypeSmall organic molecule
Emp. Form.C14H19N2O11P
Mol. Mass.422.2812
SMILESCOc1cc(cc(c1OCC(O)=O)[N+]([O-])=O)C(O)P(O)(=O)CC[C@@H](N)C(O)=O