Reaction Details
TargetMetabotropic glutamate receptor 7
LigandBDBM196906
Substrate/Competitorn/a
Meas. Tech.Pharmacological Assay
EC50 11600±1900 nM
Citation Acher, FPin, JGoudet, CEschalier, ABusserolles, JRigault, DLemasson, ICesarini, SCommare, B Hypophosphorous acid derivatives having antihyperalgic activity and biological applications thereof US Patent US9212196 Publication Date 12/15/2015
 
Metabotropic glutamate receptor 7
Name:Metabotropic glutamate receptor 7
Type:Enzyme
Mol. Mass.:102244.48
Organism:Rattus norvegicus (Rat)
Description:P35400
Residue:915
BDBM196906
NameBDBM196906
Synonyms:US9212196, Derivative 2
TypeSmall organic molecule
Emp. Form.C13H18NO8P
Mol. Mass.347.2577
SMILESN[C@@H](CCP(O)(=O)C(O)c1ccc(OCC(O)=O)cc1)C(O)=O