Reaction Details
TargetMetabotropic glutamate receptor 7
LigandBDBM196918
Substrate/Competitorn/a
Meas. Tech.Pharmacological Assay
EC50 34000±10000 nM
Citation Acher, FPin, JGoudet, CEschalier, ABusserolles, JRigault, DLemasson, ICesarini, SCommare, B Hypophosphorous acid derivatives having antihyperalgic activity and biological applications thereof US Patent US9212196 Publication Date 12/15/2015
 
Metabotropic glutamate receptor 7
Name:Metabotropic glutamate receptor 7
Type:Enzyme
Mol. Mass.:102244.48
Organism:Rattus norvegicus (Rat)
Description:P35400
Residue:915
BDBM196918
NameBDBM196918
Synonyms:US9212196, Derivative 14
TypeSmall organic molecule
Emp. Form.C12H19NO9P2
Mol. Mass.383.2281
SMILESN[C@H](CCP(O)(=O)C(O)c1ccc(OCP(O)(O)=O)cc1)C(O)=O